{"text_format":"1","workbook":"xlsx","n_sheets":13,"sheets":["Instructions","Budget","Contract Staff Detail","Q1","Q2","Q3","Q4","Q5","Final Report ","Budget Revision 1","Budget Revision","Budget Revision (2)","Budget Revision (3)"],"not_rendered":{"charts":0,"images":1,"macros":1,"external_links":1,"defined_names":38,"comments":0,"pivot_tables":0},"unopened":[],"bounds":{"document_bytes":16777216,"sheet_cells":100000,"rows_first":2000,"rows_last":500,"rows_between":2000,"halvings":0,"cell_chars":16384,"cell_head_chars":4096},"cells_cut":0,"cells_raw":0,"read":"whole","date_system":"1900"}

{"sheet":"Instructions","index":0,"n_rows":27,"n_cols":5,"rows_kept":27,"cut":false,"hidden":false,"merged":[[10,3,10,4],[15,3,15,4]]}
["Instructions for Applicants /Grantees: "]
[]
["Budget Sheet:",null,null,"Q1 Sheet:","For submitting payment requests. Please see the note below about Proof of Payment"]
[null,"Grantee Vendor Name:","Required Field","Grantee Vendor Name:","Autopopulates"]
[null,"Sigma Vendor Number:","Required Field","Sigma Vendor Number:","Autopopulates"]
[null,"Project Name","Required Field","Project Name","Autopopulates"]
[null,"Grant Given Number","Not required for application","Grant Given Number","Autopopulates"]
[null,"Contract Dates To: - From:","Not required for application","Contract Dates To: - From:","Autopopulates"]
[null,"Contact Name: ","Required Field","Contact Name: ","Autopopulates"]
[null,"Contact Name","Required Field","Contact Name","Autopopulates"]
[null,"Tasks/Items:","Required Field. To keep the form simple, combine tasks of the same type for all quarters, for example Purchase Supplies can be used for any equipment or supplies purchased for the project","Expenditures Section"]
[null,"Task Number: ","Required Field, Consecutive Numbers should be used.","Tasks/Items:","Required Field.Use the same task/item names from the budget sheet"]
[null,"Amount:","Required Field: Total Amount for each task","Task Number: ","Required Field,Make sure that the Task Numbers Match those on the Budget Sheet for each expense"]
[null,"Task/Item Total:","Auto Calculates","Amount:","Required Field: Total Amount for each task this period"]
[null,"Indirect Budget:","Not applicable for Recycling Infrastructure Grants","Task/Item Total:","Auto Calculates"]
{"$rows_left_out":13}
{"sheet":"Budget","index":1,"n_rows":63,"n_cols":13,"rows_kept":63,"cut":false,"hidden":false,"merged":[[62,7,62,8],[62,18,62,19],[62,5,62,6],[49,7,49,8],[50,7,50,8],[51,7,51,8],[52,7,52,8],[53,7,53,8],[54,7,54,8],[55,7,55,8],[56,7,56,8],[57,7,57,8],[58,7,58,8],[59,7,59,8],[60,7,60,8],[61,7,61,8],[60,5,60,6],[61,5,61,6],[58,5,58,6],[59,5,59,6],[56,5,56,6],[57,5,57,6],[54,5,54,6],[55,5,55,6],[52,5,52,6],[53,5,53,6],[50,5,50,6],[51,5,51,6],[49,5,49,6],[38,9,38,10],[28,4,28,6],[24,9,24,10],[25,9,25,10],[26,9,26,10],[27,9,27,10],[28,9,28,10],[25,4,25,6],[26,4,26,6],[27,4,27,6],[26,7,26,8],[27,7,27,8],[23,9,23,10],[28,7,28,8],[36,9,36,10],[21,7,21,8],[22,7,22,8],[23,7,23,8],[24,7,24,8],[25,7,25,8],[32,7,32,8],[33,7,33,8],[33,9,33,10],[23,4,23,6],[24,4,24,6],[18,7,18,8],[19,7,19,8],[20,7,20,8],[17,7,17,8],[17,9,17,10],[20,4,20,6],[21,4,21,6],[22,4,22,6],[18,9,18,10],[19,9,19,10],[20,9,20,10],[21,9,21,10],[22,9,22,10],[64,25,64,26],[31,9,31,10],[19,4,19,6],[4,4,4,10],[5,4,5,10],[6,4,6,10],[7,4,7,10],[9,5,9,10],[10,5,10,10],[11,5,11,10],[12,5,12,10],[14,5,14,7],[14,9,14,10],[17,4,17,6],[18,4,18,6],[15,5,15,8]]}
[]
[]
[]
[]
[null,null,null,null,"MICHIGAN DEPARTMENT OF ENVIRONMENT, GREAT LAKES, AND ENERGY"]
[null,null,null,null,"MATERIALS MANAGEMENT DIVISION - Recycling Unit"]
[null,null,null,null,"Recycling  Grant"]
[null,null,null,null,"FINANCIAL STATUS REPORT"]
[]
[null,null,null,null,"Grantee / Vendor Name:"]
[null,null,null,null,"Sigma Vendor Number:"]
[null,null,null,null,"Project Name:"]
[null,null,null,null,"Grant Given Number:"]
[null,null,null,null,"Contract Date","From:",null,"To:"]
[null,null,null,null,"Contact Name:",null,null,null,"Contact Number:"]
{"$rows_left_out":49}
{"sheet":"Contract Staff Detail","index":2,"n_rows":34,"n_cols":12,"rows_kept":34,"cut":false,"hidden":true,"merged":[[32,1,32,8],[33,1,33,8],[1,1,1,11],[7,9,7,11],[3,2,3,8],[4,2,4,8],[5,2,5,3],[7,3,7,4],[7,6,7,8]]}
[]
[null,"STAFFING DETAILS"]
[]
[null,"Grantee Name",{"$f":"Budget!#REF!","v":{"$error":"#REF!"}}]
[null,"Project Name",{"$f":"Budget!#REF!","v":{"$error":"#REF!"}}]
[null,"Tracking Number",{"$f":"Budget!#REF!","v":{"$error":"#REF!"}}]
[]
[null,null,null,"Hourly Rate Range",null,null,"GRANT",null,null,"MATCH"]
[null,"Name","Position Title","Current * ","Projected Highest **","Fringe Rate Percentage","Estimated Hours ","Estimated Salary","Estimated Fringe Total","Estimated Hours ","Estimated Salary","Estimated Fringe Total"]
[null,null,null,null,null,null,null,{"$f":"ROUND(D10*G10,0)","v":0},{"$f":"ROUND(H10*F10,0)","v":0},null,{"$f":"ROUND(D10*J10,0)","v":0},{"$f":"ROUND(F10*K10,0)","v":0}]
[null,null,null,null,null,null,null,0,{"$f":"ROUND(H11*F11,0)","v":0},null,0,0]
[null,null,null,null,null,null,null,0,0,null,0,0]
[null,null,null,null,null,null,null,0,0,null,0,0]
[null,null,null,null,null,null,null,0,0,null,0,0]
[null,null,null,null,null,null,null,0,0,null,0,0]
{"$rows_left_out":20}
{"sheet":"Q1","index":3,"n_rows":88,"n_cols":18,"rows_kept":88,"cut":false,"hidden":false,"merged":[[24,7,24,8],[29,5,29,6],[27,9,27,10],[27,5,27,6],[23,5,23,6],[23,7,23,8],[26,5,26,6],[26,7,26,8],[29,9,29,10],[29,7,29,8],[23,9,23,10],[24,9,24,10],[24,5,24,6],[44,9,44,10],[52,9,52,10],[26,9,26,10],[31,5,31,6],[30,5,30,6],[28,9,28,10],[28,5,28,6],[28,7,28,8],[33,9,33,10],[34,9,34,10],[35,9,35,10],[27,7,27,8],[31,7,31,8],[30,9,30,10],[30,7,30,8],[41,9,41,10],[42,9,42,10],[43,9,43,10],[36,9,36,10],[37,9,37,10],[38,9,38,10],[39,9,39,10],[40,9,40,10],[31,9,31,10],[32,4,32,10],[25,9,25,10],[25,5,25,6],[25,7,25,8],[10,5,10,10],[4,4,4,10],[5,4,5,10],[6,4,6,10],[7,4,7,10],[9,5,9,10],[11,5,11,10],[12,5,12,10],[14,5,14,7],[14,9,14,10],[15,5,15,8],[21,7,21,8],[22,5,22,6],[21,5,21,6],[17,4,18,10],[19,9,19,10],[19,5,19,6],[22,9,22,10],[22,7,22,8],[21,9,21,10],[19,7,19,8],[20,5,20,6],[20,7,20,8],[20,9,20,10],[47,9,47,10],[72,12,72,14],[72,15,72,17],[72,5,72,6],[72,9,72,10],[72,7,72,8],[54,9,54,10],[62,4,64,10],[61,4,61,10],[57,9,57,10],[59,9,59,10],[65,7,65,8],[49,9,49,10]]}
[]
[]
[]
[]
[null,null,null,null,"MICHIGAN DEPARTMENT OF ENVIRONMENT, GREAT LAKES, AND ENERGY"]
[null,null,null,null,{"$f":"Budget!E6","v":"MATERIALS MANAGEMENT DIVISION - Recycling Unit"}]
[null,null,null,null,{"$f":"Budget!E7","v":"Recycling  Grant"}]
[null,null,null,null,{"$f":"Budget!E8","v":"FINANCIAL STATUS REPORT"}]
[]
[null,null,null,null,"Grantee / Vendor Name:",{"$f":"IF(Budget!F10 >0,Budget!F10,\"TBD\")","v":"TBD"}]
[null,null,null,null,"Vendor Number:",{"$f":"IF(Budget!F11 >0,Budget!F11,\"TBD\")","v":"TBD"}]
[null,null,null,null,"Project Name:",{"$f":"IF(Budget!F12 >0,Budget!F12,\"TBD\")","v":"TBD"}]
[null,null,null,null,"Grant Given Number:",{"$f":"IF(Budget!F13 >0,Budget!F13,\"TBD\")","v":"TBD"}]
[null,null,null,null,"Report Period:","From:",null,"To:"]
[null,null,null,null,"Contact Name:",{"$f":"IF(Budget!F15>0,Budget!F15,\"TBD\")","v":"TBD"},null,null,"Contact Number:",{"$f":"IF(Budget!J15>0,Budget!J15,\"TBD\")","v":"TBD"}]
{"$rows_left_out":74}
{"sheet":"Q2","index":4,"n_rows":88,"n_cols":18,"rows_kept":88,"cut":false,"hidden":false,"merged":[[35,9,35,10],[44,9,44,10],[52,9,52,10],[54,9,54,10],[61,4,61,10],[36,9,36,10],[37,9,37,10],[38,9,38,10],[39,9,39,10],[40,9,40,10],[41,9,41,10],[42,9,42,10],[43,9,43,10],[47,9,47,10],[57,9,57,10],[59,9,59,10],[34,9,34,10],[29,5,29,6],[29,7,29,8],[29,9,29,10],[30,5,30,6],[30,7,30,8],[30,9,30,10],[31,5,31,6],[31,7,31,8],[31,9,31,10],[32,4,32,10],[33,9,33,10],[27,5,27,6],[27,7,27,8],[27,9,27,10],[28,5,28,6],[28,7,28,8],[28,9,28,10],[25,5,25,6],[25,7,25,8],[25,9,25,10],[26,5,26,6],[26,7,26,8],[26,9,26,10],[23,5,23,6],[23,7,23,8],[23,9,23,10],[24,5,24,6],[24,7,24,8],[24,9,24,10],[21,5,21,6],[21,7,21,8],[21,9,21,10],[22,5,22,6],[22,7,22,8],[22,9,22,10],[19,7,19,8],[19,9,19,10],[20,5,20,6],[20,7,20,8],[20,9,20,10],[72,12,72,14],[68,14,68,15],[72,15,72,17],[17,4,18,10],[4,4,4,10],[5,4,5,10],[6,4,6,10],[7,4,7,10],[9,5,9,10],[10,5,10,10],[11,5,11,10],[12,5,12,10],[14,5,14,7],[14,9,14,10],[15,5,15,8],[19,5,19,6],[49,9,49,10],[65,7,65,8],[62,4,64,10],[72,5,72,6],[72,7,72,8],[72,9,72,10]]}
[]
[]
[]
[]
[null,null,null,null,"MICHIGAN DEPARTMENT OF ENVIRONMENT, GREAT LAKES, AND ENERGY"]
[null,null,null,null,{"$f":"Budget!E6","v":"MATERIALS MANAGEMENT DIVISION - Recycling Unit"}]
[null,null,null,null,{"$f":"Budget!E7","v":"Recycling  Grant"}]
[null,null,null,null,{"$f":"Budget!E8","v":"FINANCIAL STATUS REPORT"}]
[]
[null,null,null,null,"Grantee / Vendor Name:",{"$f":"IF(Budget!F10 >0,Budget!F10,\"TBD\")","v":"TBD"}]
[null,null,null,null,"Vendor Number:",{"$f":"IF(Budget!F11 >0,Budget!F11,\"TBD\")","v":"TBD"}]
[null,null,null,null,"Project Name:",{"$f":"IF(Budget!F12 >0,Budget!F12,\"TBD\")","v":"TBD"}]
[null,null,null,null,"Grant Given Number:",{"$f":"IF(Budget!F13 >0,Budget!F13,\"TBD\")","v":"TBD"}]
[null,null,null,null,"Report Period:","From:",null,"To:"]
[null,null,null,null,"Contact Name:",{"$f":"IF(Budget!F15>0,Budget!F15,\"TBD\")","v":"TBD"},null,null,"Contact Number:",{"$f":"IF(Budget!J15>0,Budget!J15,\"TBD\")","v":"TBD"}]
{"$rows_left_out":74}
{"sheet":"Q3","index":5,"n_rows":88,"n_cols":18,"rows_kept":88,"cut":false,"hidden":false,"merged":[[28,5,28,6],[28,7,28,8],[28,9,28,10],[43,9,43,10],[42,9,42,10],[33,9,33,10],[35,9,35,10],[36,9,36,10],[37,9,37,10],[38,9,38,10],[39,9,39,10],[40,9,40,10],[47,9,47,10],[34,9,34,10],[29,5,29,6],[29,7,29,8],[29,9,29,10],[30,5,30,6],[30,7,30,8],[30,9,30,10],[31,5,31,6],[31,7,31,8],[31,9,31,10],[32,4,32,10],[41,9,41,10],[44,9,44,10],[26,5,26,6],[26,7,26,8],[26,9,26,10],[27,5,27,6],[27,7,27,8],[27,9,27,10],[24,5,24,6],[24,7,24,8],[24,9,24,10],[25,5,25,6],[25,7,25,8],[25,9,25,10],[22,5,22,6],[22,7,22,8],[22,9,22,10],[23,5,23,6],[23,7,23,8],[23,9,23,10],[20,5,20,6],[20,7,20,8],[20,9,20,10],[21,5,21,6],[21,7,21,8],[21,9,21,10],[72,15,72,17],[17,4,18,10],[4,4,4,10],[5,4,5,10],[6,4,6,10],[7,4,7,10],[9,5,9,10],[10,5,10,10],[11,5,11,10],[12,5,12,10],[14,5,14,7],[14,9,14,10],[15,5,15,8],[19,5,19,6],[19,7,19,8],[19,9,19,10],[49,9,49,10],[72,5,72,6],[72,7,72,8],[72,9,72,10],[72,12,72,14],[57,9,57,10],[59,9,59,10],[65,7,65,8],[52,9,52,10],[54,9,54,10],[61,4,61,10],[62,4,64,10]]}
[]
[]
[]
[]
[null,null,null,null,"MICHIGAN DEPARTMENT OF ENVIRONMENT, GREAT LAKES, AND ENERGY"]
[null,null,null,null,{"$f":"Budget!E6","v":"MATERIALS MANAGEMENT DIVISION - Recycling Unit"}]
[null,null,null,null,{"$f":"Budget!E7","v":"Recycling  Grant"}]
[null,null,null,null,{"$f":"Budget!E8","v":"FINANCIAL STATUS REPORT"}]
[]
[null,null,null,null,"Grantee / Vendor Name:",{"$f":"IF(Budget!F10 >0,Budget!F10,\"TBD\")","v":"TBD"}]
[null,null,null,null,"Vendor Number:",{"$f":"IF(Budget!F11 >0,Budget!F11,\"TBD\")","v":"TBD"}]
[null,null,null,null,"Project Name:",{"$f":"IF(Budget!F12 >0,Budget!F12,\"TBD\")","v":"TBD"}]
[null,null,null,null,"Grant Given Number:",{"$f":"IF(Budget!F13 >0,Budget!F13,\"TBD\")","v":"TBD"}]
[null,null,null,null,"Report Period:","From:",null,"To:"]
[null,null,null,null,"Contact Name:",{"$f":"IF(Budget!F15>0,Budget!F15,\"TBD\")","v":"TBD"},null,null,"Contact Number:",{"$f":"IF(Budget!J15>0,Budget!J15,\"TBD\")","v":"TBD"}]
{"$rows_left_out":74}
{"sheet":"Q4","index":6,"n_rows":88,"n_cols":18,"rows_kept":88,"cut":false,"hidden":false,"merged":[[35,9,35,10],[44,9,44,10],[52,9,52,10],[54,9,54,10],[61,4,61,10],[36,9,36,10],[37,9,37,10],[38,9,38,10],[39,9,39,10],[40,9,40,10],[41,9,41,10],[42,9,42,10],[43,9,43,10],[57,9,57,10],[59,9,59,10],[34,9,34,10],[29,5,29,6],[29,7,29,8],[29,9,29,10],[30,5,30,6],[30,7,30,8],[30,9,30,10],[31,5,31,6],[31,7,31,8],[31,9,31,10],[32,4,32,10],[33,9,33,10],[27,5,27,6],[27,7,27,8],[27,9,27,10],[28,5,28,6],[28,7,28,8],[28,9,28,10],[25,5,25,6],[25,7,25,8],[25,9,25,10],[26,5,26,6],[26,7,26,8],[26,9,26,10],[23,5,23,6],[23,7,23,8],[23,9,23,10],[24,5,24,6],[24,7,24,8],[24,9,24,10],[21,5,21,6],[21,7,21,8],[21,9,21,10],[22,5,22,6],[22,7,22,8],[22,9,22,10],[19,5,19,6],[19,7,19,8],[19,9,19,10],[20,5,20,6],[20,7,20,8],[20,9,20,10],[17,4,18,10],[4,4,4,10],[5,4,5,10],[6,4,6,10],[7,4,7,10],[9,5,9,10],[10,5,10,10],[11,5,11,10],[12,5,12,10],[14,5,14,7],[14,9,14,10],[15,5,15,8],[88,22,88,23],[47,9,47,10],[72,5,72,6],[72,7,72,8],[72,9,72,10],[72,12,72,14],[72,15,72,17],[65,7,65,8],[62,4,64,10],[49,9,49,10]]}
[]
[]
[]
[]
[null,null,null,null,"MICHIGAN DEPARTMENT OF ENVIRONMENT, GREAT LAKES, AND ENERGY"]
[null,null,null,null,{"$f":"Budget!E6","v":"MATERIALS MANAGEMENT DIVISION - Recycling Unit"}]
[null,null,null,null,{"$f":"Budget!E7","v":"Recycling  Grant"}]
[null,null,null,null,{"$f":"Budget!E8","v":"FINANCIAL STATUS REPORT"}]
[]
[null,null,null,null,"Grantee / Vendor Name:",{"$f":"IF(Budget!F10 >0,Budget!F10,\"TBD\")","v":"TBD"}]
[null,null,null,null,"Vendor Number:",{"$f":"IF(Budget!F11 >0,Budget!F11,\"TBD\")","v":"TBD"}]
[null,null,null,null,"Project Name:",{"$f":"IF(Budget!F12 >0,Budget!F12,\"TBD\")","v":"TBD"}]
[null,null,null,null,"Grant Given Number:",{"$f":"IF(Budget!F13 >0,Budget!F13,\"TBD\")","v":"TBD"}]
[null,null,null,null,"Report Period:","From:",null,"To:"]
[null,null,null,null,"Contact Name:",{"$f":"IF(Budget!F15>0,Budget!F15,\"TBD\")","v":"TBD"},null,null,"Contact Number:",{"$f":"IF(Budget!J15>0,Budget!J15,\"TBD\")","v":"TBD"}]
{"$rows_left_out":74}
{"sheet":"Q5","index":7,"n_rows":88,"n_cols":18,"rows_kept":88,"cut":false,"hidden":false,"merged":[[28,5,28,6],[28,7,28,8],[28,9,28,10],[43,9,43,10],[42,9,42,10],[33,9,33,10],[35,9,35,10],[36,9,36,10],[37,9,37,10],[38,9,38,10],[39,9,39,10],[40,9,40,10],[47,9,47,10],[34,9,34,10],[29,5,29,6],[29,7,29,8],[29,9,29,10],[30,5,30,6],[30,7,30,8],[30,9,30,10],[31,5,31,6],[31,7,31,8],[31,9,31,10],[32,4,32,10],[41,9,41,10],[44,9,44,10],[26,5,26,6],[26,7,26,8],[26,9,26,10],[27,5,27,6],[27,7,27,8],[27,9,27,10],[24,5,24,6],[24,7,24,8],[24,9,24,10],[25,5,25,6],[25,7,25,8],[25,9,25,10],[22,5,22,6],[22,7,22,8],[22,9,22,10],[23,5,23,6],[23,7,23,8],[23,9,23,10],[20,5,20,6],[20,7,20,8],[20,9,20,10],[21,5,21,6],[21,7,21,8],[21,9,21,10],[72,15,72,17],[17,4,18,10],[4,4,4,10],[5,4,5,10],[6,4,6,10],[7,4,7,10],[9,5,9,10],[10,5,10,10],[11,5,11,10],[12,5,12,10],[14,5,14,7],[14,9,14,10],[15,5,15,8],[19,5,19,6],[19,7,19,8],[19,9,19,10],[49,9,49,10],[72,5,72,6],[72,7,72,8],[72,9,72,10],[72,12,72,14],[57,9,57,10],[59,9,59,10],[65,7,65,8],[52,9,52,10],[54,9,54,10],[61,4,61,10],[62,4,64,10]]}
[]
[]
[]
[]
[null,null,null,null,"MICHIGAN DEPARTMENT OF ENVIRONMENT, GREAT LAKES, AND ENERGY"]
[null,null,null,null,{"$f":"Budget!E6","v":"MATERIALS MANAGEMENT DIVISION - Recycling Unit"}]
[null,null,null,null,{"$f":"Budget!E7","v":"Recycling  Grant"}]
[null,null,null,null,{"$f":"Budget!E8","v":"FINANCIAL STATUS REPORT"}]
[]
[null,null,null,null,"Grantee / Vendor Name:",{"$f":"IF(Budget!F10 >0,Budget!F10,\"TBD\")","v":"TBD"}]
[null,null,null,null,"Vendor Number:",{"$f":"IF(Budget!F11 >0,Budget!F11,\"TBD\")","v":"TBD"}]
[null,null,null,null,"Project Name:",{"$f":"IF(Budget!F12 >0,Budget!F12,\"TBD\")","v":"TBD"}]
[null,null,null,null,"Grant Given Number:",{"$f":"IF(Budget!F13 >0,Budget!F13,\"TBD\")","v":"TBD"}]
[null,null,null,null,"Report Period:","From:",null,"To:"]
[null,null,null,null,"Contact Name:",{"$f":"IF(Budget!F15>0,Budget!F15,\"TBD\")","v":"TBD"},null,null,"Contact Number:",{"$f":"IF(Budget!J15>0,Budget!J15,\"TBD\")","v":"TBD"}]
{"$rows_left_out":74}
{"sheet":"Final Report ","index":8,"n_rows":88,"n_cols":18,"rows_kept":88,"cut":false,"hidden":false,"merged":[[28,5,28,6],[28,7,28,8],[28,9,28,10],[43,9,43,10],[42,9,42,10],[33,9,33,10],[35,9,35,10],[36,9,36,10],[37,9,37,10],[38,9,38,10],[39,9,39,10],[40,9,40,10],[47,9,47,10],[34,9,34,10],[29,5,29,6],[29,7,29,8],[29,9,29,10],[30,5,30,6],[30,7,30,8],[30,9,30,10],[31,5,31,6],[31,7,31,8],[31,9,31,10],[32,4,32,10],[41,9,41,10],[44,9,44,10],[26,5,26,6],[26,7,26,8],[26,9,26,10],[27,5,27,6],[27,7,27,8],[27,9,27,10],[24,5,24,6],[24,7,24,8],[24,9,24,10],[25,5,25,6],[25,7,25,8],[25,9,25,10],[22,5,22,6],[22,7,22,8],[22,9,22,10],[23,5,23,6],[23,7,23,8],[23,9,23,10],[20,5,20,6],[20,7,20,8],[20,9,20,10],[21,5,21,6],[21,7,21,8],[21,9,21,10],[72,15,72,17],[17,4,18,10],[4,4,4,10],[5,4,5,10],[6,4,6,10],[7,4,7,10],[9,5,9,10],[10,5,10,10],[11,5,11,10],[12,5,12,10],[14,5,14,7],[14,9,14,10],[15,5,15,8],[19,5,19,6],[19,7,19,8],[19,9,19,10],[49,9,49,10],[72,5,72,6],[72,7,72,8],[72,9,72,10],[72,12,72,14],[57,9,57,10],[59,9,59,10],[65,7,65,8],[52,9,52,10],[54,9,54,10],[61,4,61,10],[62,4,64,10]]}
[]
[]
[]
[]
[null,null,null,null,"MICHIGAN DEPARTMENT OF ENVIRONMENT, GREAT LAKES, AND ENERGY"]
[null,null,null,null,{"$f":"Budget!E6","v":"MATERIALS MANAGEMENT DIVISION - Recycling Unit"}]
[null,null,null,null,{"$f":"Budget!E7","v":"Recycling  Grant"}]
[null,null,null,null,{"$f":"Budget!E8","v":"FINANCIAL STATUS REPORT"}]
[]
[null,null,null,null,"Grantee / Vendor Name:",{"$f":"IF(Budget!F10 >0,Budget!F10,\"TBD\")","v":"TBD"}]
[null,null,null,null,"Vendor Number:",{"$f":"IF(Budget!F11 >0,Budget!F11,\"TBD\")","v":"TBD"}]
[null,null,null,null,"Project Name:",{"$f":"IF(Budget!F12 >0,Budget!F12,\"TBD\")","v":"TBD"}]
[null,null,null,null,"Grant Given Number:",{"$f":"IF(Budget!F13 >0,Budget!F13,\"TBD\")","v":"TBD"}]
[null,null,null,null,"Report Period:","From:",null,"To:"]
[null,null,null,null,"Contact Name:",{"$f":"IF(Budget!F15>0,Budget!F15,\"TBD\")","v":"TBD"},null,null,"Contact Number:",{"$f":"IF(Budget!J15>0,Budget!J15,\"TBD\")","v":"TBD"}]
{"$rows_left_out":74}
{"sheet":"Budget Revision 1","index":9,"n_rows":37,"n_cols":13,"rows_kept":37,"cut":false,"hidden":false,"merged":[[17,4,17,6],[17,7,17,8],[17,9,17,10],[4,4,4,12],[5,4,5,12],[6,4,6,12],[7,4,7,12],[9,5,9,12],[10,5,10,12],[11,5,11,12],[12,5,12,12],[14,5,14,7],[14,9,14,10],[15,5,15,8],[18,4,18,6],[18,7,18,8],[18,9,18,10],[19,4,19,6],[19,7,19,8],[19,9,19,10],[20,4,20,6],[20,7,20,8],[20,9,20,10],[21,4,21,6],[21,7,21,8],[21,9,21,10],[22,4,22,6],[22,7,22,8],[22,9,22,10],[23,4,23,6],[23,7,23,8],[23,9,23,10],[24,4,24,6],[24,7,24,8],[24,9,24,10],[25,4,25,6],[25,7,25,8],[25,9,25,10],[26,4,26,6],[26,7,26,8],[26,9,26,10],[27,4,27,6],[27,7,27,8],[27,9,27,10],[35,9,35,10],[37,4,38,12],[28,4,28,6],[28,7,28,8],[28,9,28,10],[32,7,32,8],[33,7,33,8],[33,9,33,10],[30,7,30,8],[31,7,31,8],[31,9,31,10]]}
[]
[]
[]
[]
[null,null,null,null,"MICHIGAN DEPARTMENT OF ENVIRONMENT, GREAT LAKES, AND ENERGY"]
[null,null,null,null,{"$f":"Budget!E6","v":"MATERIALS MANAGEMENT DIVISION - Recycling Unit"}]
[null,null,null,null,{"$f":"Budget!E7","v":"Recycling  Grant"}]
[null,null,null,null,{"$f":"Budget!E8","v":"FINANCIAL STATUS REPORT"}]
[]
[null,null,null,null,"Grantee / Vendor Name:",{"$f":"IF(Budget!F10>0,Budget!F10,\" \")","v":" "}]
[null,null,null,null,"Vendor Number:",{"$f":"IF(Budget!F11>0,Budget!F11,\" \")","v":" "}]
[null,null,null,null,"Project Name:",{"$f":"IF(Budget!F12>0,Budget!F12,\" \")","v":" "}]
[null,null,null,null,"Grant Given Number:",{"$f":"IF(Budget!F13>0,Budget!F13,\" \")","v":" "}]
[null,null,null,null,"Contract Date","From:",{"$f":"IF(Budget!G14>0,Budget!G14,\" \")","v":" "},"To:",{"$f":"IF(Budget!I14>0,Budget!I14,\" \")","v":" "}]
[null,null,null,null,"Contact Name:",{"$f":"IF(Budget!F15>0,Budget!F15,\" \")","v":" "},null,null,"Contact Number:",{"$f":"IF(Budget!J15>0,Budget!J15,\" \")","v":" "}]
{"$rows_left_out":23}
{"sheet":"Budget Revision","index":10,"n_rows":65,"n_cols":10,"rows_kept":65,"cut":false,"hidden":true,"merged":[[65,1,65,6],[2,1,2,9],[3,1,3,9],[4,1,4,9],[7,2,7,9],[8,2,8,9],[11,2,11,4],[11,6,11,9],[9,5,9,6],[9,2,9,3]]}
[]
[]
[null,"MICHIGAN DEPARTMENT OF ENVIRONMENTAL QUALITY"]
[null,{"$f":"Budget!E6:K6","v":{"$error":"#VALUE!"}}]
[null,"BUDGET REVISION"]
[]
[]
[null,"Grantee Organization Name: ",{"$f":"Budget!#REF!","v":{"$error":"#REF!"}}]
[null,"Project Name: ",{"$f":"Budget!#REF!","v":{"$error":"#REF!"}}]
[null,"Tracking Code Number: ",{"$f":"Budget!#REF!","v":{"$error":"#REF!"}},null,"Period Cover",null,null,"Date Submitted"]
[]
[null,null,"GRANT",null,null,null,"MATCH"]
[null,"BUDGET CATEGORIES","Approved Budget","Proposed Change","Revised Project Grant Funds",null,"Approved Local Match","Proposed Change","Revised Local Match Funds","TOTAL              "]
[null,"STAFFING AND FRINGE"]
[null,{"$f":"Budget!#REF!","v":{"$error":"#REF!"}},{"$f":"Budget!#REF!","v":{"$error":"#REF!"}},0,{"$f":"SUM(C15:D15)","v":{"$error":"#REF!"}},null,{"$f":"Budget!#REF!","v":{"$error":"#REF!"}},0,{"$f":"SUM(G15:H15)","v":{"$error":"#REF!"}},{"$f":"SUM(E15,I15)","v":{"$error":"#REF!"}}]
{"$rows_left_out":51}
{"sheet":"Budget Revision (2)","index":11,"n_rows":65,"n_cols":10,"rows_kept":65,"cut":false,"hidden":true,"merged":[[11,2,11,4],[11,6,11,9],[65,1,65,6],[2,1,2,9],[3,1,3,9],[4,1,4,9],[7,2,7,9],[8,2,8,9],[9,2,9,3],[9,5,9,6]]}
[]
[]
[null,"MICHIGAN DEPARTMENT OF ENVIRONMENTAL QUALITY"]
[null,{"$f":"Budget!E6:K6","v":{"$error":"#VALUE!"}}]
[null,"BUDGET REVISION"]
[]
[]
[null,"Grantee Organization Name: ",{"$f":"Budget!#REF!","v":{"$error":"#REF!"}}]
[null,"Project Name: ",{"$f":"Budget!#REF!","v":{"$error":"#REF!"}}]
[null,"Tracking Code Number: ",{"$f":"Budget!#REF!","v":{"$error":"#REF!"}},null,"Period Cover",null,null,"Date Submitted"]
[]
[null,null,"GRANT",null,null,null,"MATCH"]
[null,"BUDGET CATEGORIES","Approved Budget","Proposed Change","Revised Project Grant Funds",null,"Approved Local Match","Proposed Change","Revised Local Match Funds","TOTAL              "]
[null,"STAFFING AND FRINGE"]
[null,{"$f":"Budget!#REF!","v":{"$error":"#REF!"}},{"$f":"Budget!#REF!","v":{"$error":"#REF!"}},0,{"$f":"SUM(C15:D15)","v":{"$error":"#REF!"}},null,{"$f":"Budget!#REF!","v":{"$error":"#REF!"}},0,{"$f":"SUM(G15:H15)","v":{"$error":"#REF!"}},{"$f":"SUM(E15,I15)","v":{"$error":"#REF!"}}]
{"$rows_left_out":51}
{"sheet":"Budget Revision (3)","index":12,"n_rows":65,"n_cols":10,"rows_kept":65,"cut":false,"hidden":true,"merged":[[11,2,11,4],[11,6,11,9],[65,1,65,6],[2,1,2,9],[3,1,3,9],[4,1,4,9],[7,2,7,9],[8,2,8,9],[9,2,9,3],[9,5,9,6]]}
[]
[]
[null,"MICHIGAN DEPARTMENT OF ENVIRONMENTAL QUALITY"]
[null,{"$f":"Budget!E6:K6","v":{"$error":"#VALUE!"}}]
[null,"BUDGET REVISION"]
[]
[]
[null,"Grantee Organization Name: ",{"$f":"Budget!#REF!","v":{"$error":"#REF!"}}]
[null,"Project Name: ",{"$f":"Budget!#REF!","v":{"$error":"#REF!"}}]
[null,"Tracking Code Number: ",{"$f":"Budget!#REF!","v":{"$error":"#REF!"}},null,"Period Cover",null,null,"Date Submitted"]
[]
[null,null,"GRANT",null,null,null,"MATCH"]
[null,"BUDGET CATEGORIES","Approved Budget","Proposed Change","Revised Project Grant Funds",null,"Approved Local Match","Proposed Change","Revised Local Match Funds","TOTAL              "]
[null,"STAFFING AND FRINGE"]
[null,{"$f":"Budget!#REF!","v":{"$error":"#REF!"}},{"$f":"Budget!#REF!","v":{"$error":"#REF!"}},0,{"$f":"SUM(C15:D15)","v":{"$error":"#REF!"}},null,{"$f":"Budget!#REF!","v":{"$error":"#REF!"}},0,{"$f":"SUM(G15:H15)","v":{"$error":"#REF!"}},{"$f":"SUM(E15,I15)","v":{"$error":"#REF!"}}]
{"$rows_left_out":50}